BDBM50073562 1-[4-(4-Amino-6,7-dimethoxy-quinazolin-2-yl)-piperazin-1-yl]-2-(2-isopropyl-6-methoxy-phenoxy)-2-methyl-propan-1-one::CHEMBL435591
SMILES COc1cc2nc(nc(N)c2cc1OC)N1CCN(CC1)C(=O)C(C)(C)Oc1c(OC)cccc1C(C)C
InChI Key InChIKey=RAMKRNRAZRVJGG-UHFFFAOYSA-N
Data  3 IC50
  Tab Delimited (TSV)   2D SDfile   Computed 3D by Vconf -m prep SDfile
Find this compound or compounds like it in BindingDB:
Activity Spreadsheet -- Enzyme Inhibition Constant Data from BindingDB
Found 3 hits for monomerid = 50073562
TargetD(2) dopamine receptor(Rattus norvegicus (rat))
Recordati
Curated by ChEMBL
LigandPNGBDBM50073562(1-[4-(4-Amino-6,7-dimethoxy-quinazolin-2-yl)-piper...)
Affinity DataIC50: >1.00E+3nM. Assay description: Inhibitory concentration against Dopamine receptor D2 (Inactive at >1000 nM concentration)
In DepthDetails ArticlePubMed
Target5-hydroxytryptamine receptor 1A(Rattus norvegicus (rat))
Recordati
Curated by ChEMBL
LigandPNGBDBM50073562(1-[4-(4-Amino-6,7-dimethoxy-quinazolin-2-yl)-piper...)
Affinity DataIC50: >1.00E+3nM. Assay description: Inhibitory concentration against 5-hydroxytryptamine 1A receptor (Inactive at >1000 nM concentration)
In DepthDetails ArticlePubMed
Target5-hydroxytryptamine receptor 2A(Rattus norvegicus (rat))
Recordati
Curated by ChEMBL
LigandPNGBDBM50073562(1-[4-(4-Amino-6,7-dimethoxy-quinazolin-2-yl)-piper...)
Affinity DataIC50: >1.00E+3nM. Assay description: Inhibitory concentration against 5-hydroxytryptamine 2A receptor (Inactive at >1000 nM concentration)
In DepthDetails ArticlePubMed