BDBM50077559 1-{4-[3-(3-Fluoro-phenyl)-prop-2-ynyloxy]-[1,2,5]thiadiazol-3-yl}-4-aza-tricyclo[2.2.1.0*2,6*]heptane::CHEMBL304247
SMILES Fc1cccc(c1)C#CCOc1nsnc1C12CN3CC1C2C3
InChI Key InChIKey=CCIIKCAPSDBABC-UHFFFAOYSA-N
Data  1 IC50  2 EC50
  Tab Delimited (TSV)   2D SDfile   Computed 3D by Vconf -m prep SDfile
Find this compound or compounds like it in BindingDB:
Activity Spreadsheet -- Enzyme Inhibition Constant Data from BindingDB
Found 3 hits for monomerid = 50077559
TargetMuscarinic acetylcholine receptor M1(Homo sapiens (Human))
Novo Nordisk
Curated by ChEMBL
LigandPNGBDBM50077559(1-{4-[3-(3-Fluoro-phenyl)-prop-2-ynyloxy]-[1,2,5]t...)
Affinity DataEC50:  4.90nM. Assay description: Compound was tested for its ability to stimulate phosphoinositol (PI) hydrolysis in the mouse fibroblast cell line A9L-M1 expressing Muscarinic acety...
In DepthDetails ArticlePubMed
TargetMuscarinic acetylcholine receptor M2(RAT)
Novo Nordisk
Curated by ChEMBL
LigandPNGBDBM50077559(1-{4-[3-(3-Fluoro-phenyl)-prop-2-ynyloxy]-[1,2,5]t...)
Affinity DataIC50:  21nM. Assay description: Inhibition of [3H]- Oxo-M binding at Muscarinic acetylcholine receptor M2 in rat brain membranes.
In DepthDetails ArticlePubMed
TargetMuscarinic acetylcholine receptor M2(Homo sapiens (Human))
Novo Nordisk
Curated by ChEMBL
LigandPNGBDBM50077559(1-{4-[3-(3-Fluoro-phenyl)-prop-2-ynyloxy]-[1,2,5]t...)
Affinity DataEC50:  683nM. Assay description: Compound was tested for its potency at M-2 receptor by inhibiting forskolin induced c-AMP formation in CHO-M2 cells human M2 receptor
In DepthDetails ArticlePubMed