BDBM50079075 4-{2-[4-((R)-3,10-Dibromo-8-chloro-6,11-dihydro-5H-benzo[5,6]cyclohepta[1,2-b]pyridin-11-yl)-piperidin-1-yl]-2-oxo-ethyl}-piperidine-1-carboxylic acid carbamoylmethyl-amide::CHEMBL327204
SMILES NC(=O)CNC(=O)N1CCC(CC(=O)N2CCC(CC2)[C@H]2c3ncc(Br)cc3CCc3cc(Cl)cc(Br)c23)CC1
InChI Key InChIKey=XEOVKXSFYIXXCT-HHHXNRCGSA-N
Data  2 IC50
  Tab Delimited (TSV)   2D SDfile   Computed 3D by Vconf -m prep SDfile
Find this compound or compounds like it in BindingDB:
Activity Spreadsheet -- Enzyme Inhibition Constant Data from BindingDB
Found 2 hits for monomerid = 50079075
TargetDimer of Protein farnesyltransferase subunit beta(Homo sapiens (Human))
Schering-Plough Research Institute
Curated by ChEMBL
LigandPNGBDBM50079075(4-{2-[4-((R)-3,10-Dibromo-8-chloro-6,11-dihydro-5H...)
Affinity DataIC50:  25nM. Assay description: Effect on Ras processing in Cos-1 monkey kidney cells expressing either H-Ras-Val 12-CVLS or H-Ras-Val12.
In DepthDetails ArticlePubMed
TargetDimer of Protein farnesyltransferase subunit beta(Homo sapiens (Human))
Schering-Plough Research Institute
Curated by ChEMBL
LigandPNGBDBM50079075(4-{2-[4-((R)-3,10-Dibromo-8-chloro-6,11-dihydro-5H...)
Affinity DataIC50:  0.900nM. Assay description: Inhibition of [3H]-FPP incorporation into His6-H-Ras-CVLS by farnesyl transferase
In DepthDetails ArticlePubMed