BDBM50083540 CHEMBL3423410
SMILES [H][C@]12CC[C@@H](CN1CCc1c2[nH]c2ccccc12)C(=O)NCCCCCC(=O)N1CCC[C@@H]1C(=O)N[C@@H](Cc1ccc(F)c(F)c1)C(=O)N[C@@H](CCCCN)C(N)=O
InChI Key InChIKey=TXVUROLPUDSHNS-XHUJMWDFSA-N
Data  4 Kd
  Tab Delimited (TSV)   2D SDfile   Computed 3D by Vconf -m prep SDfile
Find this compound or compounds like it in BindingDB:
Activity Spreadsheet -- Enzyme Inhibition Constant Data from BindingDB
Found 4 hits for monomerid = 50083540
TargetD(2) dopamine receptor(Homo sapiens (Human))
University Of Barcelona
Curated by ChEMBL
LigandPNGBDBM50083540(CHEMBL3423410)
Affinity DataKd:  200nM. Assay description: Displacement of [3H]-YM09151-2 from dopamine D2 receptor (unknown origin) expressed in sheep striatum membranes assessed as high affinity constant af...
In DepthDetails ArticlePubMed
TargetD(1A) dopamine receptor(Homo sapiens (Human))
University Of Barcelona
Curated by ChEMBL
LigandPNGBDBM50083540(CHEMBL3423410)
Affinity DataKd:  2.40E+4nM. Assay description: Displacement of [3H]-SCH23390 from dopamine D1 receptor (unknown origin) expressed in sheep striatum membranes assessed as low affinity constant afte...
In DepthDetails ArticlePubMed
TargetD(1A) dopamine receptor(Homo sapiens (Human))
University Of Barcelona
Curated by ChEMBL
LigandPNGBDBM50083540(CHEMBL3423410)
Affinity DataKd:  1.50E+3nM. Assay description: Displacement of [3H]-SCH23390 from dopamine D1 receptor (unknown origin) expressed in sheep striatum membranes assessed as high affinity constant aft...
In DepthDetails ArticlePubMed
TargetD(2) dopamine receptor(Homo sapiens (Human))
University Of Barcelona
Curated by ChEMBL
LigandPNGBDBM50083540(CHEMBL3423410)
Affinity DataKd:  4.00E+3nM. Assay description: Displacement of [3H]-YM09151-2 from dopamine D2 receptor (unknown origin) expressed in sheep striatum membranes assessed as low affinity constant aft...
In DepthDetails ArticlePubMed