BDBM50087479 3-[2-(6-Methoxy-1,3,3a,4,5,9b-hexahydro-benzo[e]isoindol-2-yl)-ethyl]-9-methyl-1H-benzo[4,5]thieno[3,2-d]pyrimidine-2,4-dione::CHEMBL39037
SMILES COc1cccc2[C@@H]3CN(CCn4c(=O)[nH]c5c(sc6cccc(C)c56)c4=O)C[C@@H]3CCc12
InChI Key InChIKey=WILFKKPCOOPYST-QFBILLFUSA-N
Data  3 KI
  Tab Delimited (TSV)   2D SDfile   Computed 3D by Vconf -m prep SDfile
Find this compound or compounds like it in BindingDB:
Activity Spreadsheet -- Enzyme Inhibition Constant Data from BindingDB
Found 3 hits for monomerid = 50087479
TargetAlpha-1D adrenergic receptor(Rattus norvegicus (Rat))
Abbott Laboratories
Curated by ChEMBL
LigandPNGBDBM50087479(3-[2-(6-Methoxy-1,3,3a,4,5,9b-hexahydro-benzo[e]is...)
Affinity DataKi:  0.880nM. Assay description: In vitro binding affinity using [3H]-prazosin as radioligand against alpha-1D adrenergic receptor expressed in LTK cell
In DepthDetails ArticlePubMed
TargetAlpha-1A adrenergic receptor(Rattus norvegicus (Rat))
Abbott Laboratories
Curated by ChEMBL
LigandPNGBDBM50087479(3-[2-(6-Methoxy-1,3,3a,4,5,9b-hexahydro-benzo[e]is...)
Affinity DataKi:  1.29nM. Assay description: In vitro binding affinity using [3H]-prazosin as radioligand against alpha-1A adrenergic receptor
In DepthDetails ArticlePubMed
TargetAlpha-1B adrenergic receptor(C.H.O.)
Abbott Laboratories
Curated by ChEMBL
LigandPNGBDBM50087479(3-[2-(6-Methoxy-1,3,3a,4,5,9b-hexahydro-benzo[e]is...)
Affinity DataKi:  6.95nM. Assay description: In vitro binding affinity using [3H]-prazosin as radioligand against alpha-1B adrenergic receptor expressed in LTK cell
In DepthDetails ArticlePubMed