BDBM50089787 Benzoic acid 8-methyl-8-aza-bicyclo[3.2.1]oct-6-yl ester::CHEMBL85190
SMILES CN1C2CC(OC(=O)c3ccccc3)C1CCC2
InChI Key InChIKey=ARWACDLWRNGONO-UHFFFAOYSA-N
Data  7 KI
  Tab Delimited (TSV)   2D SDfile   Computed 3D by Vconf -m prep SDfile
Find this compound or compounds like it in BindingDB:
Activity Spreadsheet -- Enzyme Inhibition Constant Data from BindingDB
Found 7 hits for monomerid = 50089787
TargetMuscarinic acetylcholine receptor M2(Homo sapiens (Human))
National Institute Of Diabetes And Digestive And Kidney Diseases
Curated by ChEMBL
LigandPNGBDBM50089787(Benzoic acid 8-methyl-8-aza-bicyclo[3.2.1]oct-6-yl...)
Affinity DataKi:  260nM. Assay description: Inhibition of [3H]- quinuclidinyl benzilate binding to human Muscarinic acetylcholine receptor M2 expressed in CHO cell membrane
In DepthDetails ArticlePubMed
TargetMuscarinic acetylcholine receptor M1(Homo sapiens (Human))
National Institute Of Diabetes And Digestive And Kidney Diseases
Curated by ChEMBL
LigandPNGBDBM50089787(Benzoic acid 8-methyl-8-aza-bicyclo[3.2.1]oct-6-yl...)
Affinity DataKi:  270nM. Assay description: Inhibition of [3H]- oxotremorine-M binding to human Muscarinic acetylcholine receptor M1 expressed in CHO cell membranes
In DepthDetails ArticlePubMed
TargetMuscarinic acetylcholine receptor M1(Homo sapiens (Human))
National Institute Of Diabetes And Digestive And Kidney Diseases
Curated by ChEMBL
LigandPNGBDBM50089787(Benzoic acid 8-methyl-8-aza-bicyclo[3.2.1]oct-6-yl...)
Affinity DataKi:  270nM. Assay description: Inhibition of [3H]- oxotremorine-M binding to human Muscarinic acetylcholine receptor M1 expressed in CHO cell membranes
In DepthDetails ArticlePubMed
TargetMuscarinic acetylcholine receptor M4(Homo sapiens (Human))
National Institute Of Diabetes And Digestive And Kidney Diseases
Curated by ChEMBL
LigandPNGBDBM50089787(Benzoic acid 8-methyl-8-aza-bicyclo[3.2.1]oct-6-yl...)
Affinity DataKi:  410nM. Assay description: Inhibition of [3H]- quinuclidinyl benzilate binding to Muscarinic acetylcholine receptor M4 expressed in CHO cell membranes
In DepthDetails ArticlePubMed
TargetMuscarinic acetylcholine receptor M4(Homo sapiens (Human))
National Institute Of Diabetes And Digestive And Kidney Diseases
Curated by ChEMBL
LigandPNGBDBM50089787(Benzoic acid 8-methyl-8-aza-bicyclo[3.2.1]oct-6-yl...)
Affinity DataKi:  910nM. Assay description: Inhibition of [3H]- oxotremorine-M binding to human Muscarinic acetylcholine receptor M4 in CHO cell membranes
In DepthDetails ArticlePubMed
TargetMuscarinic acetylcholine receptor M2(Homo sapiens (Human))
National Institute Of Diabetes And Digestive And Kidney Diseases
Curated by ChEMBL
LigandPNGBDBM50089787(Benzoic acid 8-methyl-8-aza-bicyclo[3.2.1]oct-6-yl...)
Affinity DataKi:  1.30E+3nM. Assay description: Inhibition of [3H]- oxotremorine-M binding to human Muscarinic acetylcholine receptor M2 expressed in CHO cell membranes
In DepthDetails ArticlePubMed
TargetMuscarinic acetylcholine receptor M3(Homo sapiens (Human))
National Institute Of Diabetes And Digestive And Kidney Diseases
Curated by ChEMBL
LigandPNGBDBM50089787(Benzoic acid 8-methyl-8-aza-bicyclo[3.2.1]oct-6-yl...)
Affinity DataKi:  3.20E+3nM. Assay description: Inhibition of [3H]- quinuclidinyl benzilate binding to human Muscarinic acetylcholine receptor M3 expressed in CHO cell membranes
In DepthDetails ArticlePubMed