BDBM50090524 4-Amino-N-(2,6-bis-methylamino-pyridin-4-yl)-benzenesulfonamide::4-Amino-N-(2,6-diamino-pyridin-4-yl)-benzenesulfonamide::4-Amino-N-(2-methylamino-pyridin-4-yl)-benzenesulfonamide::CHEMBL46071::N-(2,6-bis(methylamino)pyridin-4-yl)-4-aminobenzenesulfonamide::Ro-63-0563
SMILES CNc1cc(NS(=O)(=O)c2ccc(N)cc2)cc(NC)n1
InChI Key InChIKey=PTFNKZLSFWJYFJ-UHFFFAOYSA-N
Data  9 KI
  Tab Delimited (TSV)   2D SDfile   Computed 3D by Vconf -m prep SDfile
Find this compound or compounds like it in BindingDB:
Activity Spreadsheet -- Enzyme Inhibition Constant Data from BindingDB
Found 9 hits for monomerid = 50090524
Target5-hydroxytryptamine receptor 6(Homo sapiens (Human))
Universidad Complutense De Madrid
Curated by ChEMBL
LigandPNGBDBM50090524(4-Amino-N-(2,6-bis-methylamino-pyridin-4-yl)-benze...)
Affinity DataKi:  12nM. Assay description: Antagonist activity at human recombinant 5HT6 receptor expressed in CHO cells
In DepthDetails ArticlePubMed
Target5-hydroxytryptamine receptor 6(Homo sapiens (Human))
Universidad Complutense De Madrid
Curated by ChEMBL
LigandPNGBDBM50090524(4-Amino-N-(2,6-bis-methylamino-pyridin-4-yl)-benze...)
Affinity DataKi:  12nM. Assay description: Displacement of [3H]LSD from human 5HT6 receptor expressed in HeLa cells
In DepthDetails ArticlePubMed
Target5-hydroxytryptamine receptor 6(Homo sapiens (Human))
Universidad Complutense De Madrid
Curated by ChEMBL
LigandPNGBDBM50090524(4-Amino-N-(2,6-bis-methylamino-pyridin-4-yl)-benze...)
Affinity DataKi:  12nM. Assay description: Binding affinity towards human 5-hydroxytryptamine 6 receptor
In DepthDetails ArticlePubMed
Target5-hydroxytryptamine receptor 6(Homo sapiens (Human))
Universidad Complutense De Madrid
Curated by ChEMBL
LigandPNGBDBM50090524(4-Amino-N-(2,6-bis-methylamino-pyridin-4-yl)-benze...)
Affinity DataKi:  12nM. Assay description: Displacement of [3H]LSD from human 5-HT6 receptor expressed in human HeLa cells after 1 hr by scintillation spectroscopic analysis
In DepthDetails ArticlePubMed
Target5-hydroxytryptamine receptor 6(Homo sapiens (Human))
Universidad Complutense De Madrid
Curated by ChEMBL
LigandPNGBDBM50090524(4-Amino-N-(2,6-bis-methylamino-pyridin-4-yl)-benze...)
Affinity DataKi:  13nM. Assay description: Displacement of [3H]-LSD from human 5-hydroxytryptamine 6 receptor expressed in HEK 293 cells
In DepthDetails ArticlePubMed
Target5-hydroxytryptamine receptor 6(Homo sapiens (Human))
Universidad Complutense De Madrid
Curated by ChEMBL
LigandPNGBDBM50090524(4-Amino-N-(2,6-bis-methylamino-pyridin-4-yl)-benze...)
Affinity DataKi:  14.8nM. Assay description: Inhibition of [3H]-LSD binding to human 5-hydroxytryptamine 6 receptor expressed in HEK293 cells
In DepthDetails ArticlePubMed
Target5-hydroxytryptamine receptor 6(Homo sapiens (Human))
Universidad Complutense De Madrid
Curated by ChEMBL
LigandPNGBDBM50090524(4-Amino-N-(2,6-bis-methylamino-pyridin-4-yl)-benze...)
Affinity DataKi:  16nM. Assay description: Binding affinity for human 5-hydroxytryptamine 6 receptorChecked by Author
In DepthDetails ArticlePubMed
Target5-hydroxytryptamine receptor 6(Homo sapiens (Human))
Universidad Complutense De Madrid
Curated by ChEMBL
LigandPNGBDBM50090524(4-Amino-N-(2,6-bis-methylamino-pyridin-4-yl)-benze...)
Affinity DataKi:  512nM. Assay description: Displacement of [3H]-LSD from human cloned 5HT6 receptor expressed in HEK293 cells
In DepthDetails ArticlePubMed
Target5-hydroxytryptamine receptor 2C(Homo sapiens (Human))
University Of Copenhagen
Curated by ChEMBL
LigandPNGBDBM50090524(4-Amino-N-(2,6-bis-methylamino-pyridin-4-yl)-benze...)
Affinity DataKi:  2.04E+3nM. Assay description: Displacement of [3H]5-HT from human recombinant 5-HT2C receptor expressed in mouse 3T3 cells
In DepthDetails ArticlePubMed