BDBM50090929 CHEMBL420637::L-Arg NO2-L-Dbu-OH
SMILES NCC[C@H](NC(=O)[C@@H](N)CCCNC(=N)N[N+]([O-])=O)C(O)=O
InChI Key InChIKey=BATAYPXSEOMBHC-BQBZGAKWSA-N
Data  3 KI
  Tab Delimited (TSV)   2D SDfile   Computed 3D by Vconf -m prep SDfile
Find this compound or compounds like it in BindingDB:
Activity Spreadsheet -- Enzyme Inhibition Constant Data from BindingDB
Found 3 hits for monomerid = 50090929
TargetNitric oxide synthase, brain(Homo sapiens (Human))
Northwestern University
Curated by ChEMBL
LigandPNGBDBM50090929(CHEMBL420637 | L-Arg NO2-L-Dbu-OH)
Affinity DataKi:  2.84E+4nM. Assay description: Binding affinity against bovine brain nNOS (neuronal).
In DepthDetails ArticlePubMed
TargetNitric oxide synthase, endothelial(Bos taurus (bovine))
Northwestern University
Curated by ChEMBL
LigandPNGBDBM50090929(CHEMBL420637 | L-Arg NO2-L-Dbu-OH)
Affinity DataKi:  9.80E+4nM. Assay description: Binding affinity against recombinant bovine Endothelial nitric oxide synthase.
In DepthDetails ArticlePubMed
TargetNitric oxide synthase, inducible(Mus musculus (mouse))
Northwestern University
Curated by ChEMBL
LigandPNGBDBM50090929(CHEMBL420637 | L-Arg NO2-L-Dbu-OH)
Affinity DataKi:  1.21E+6nM. Assay description: Binding affinity against recombinant murine Inducible nitric oxide synthase.
In DepthDetails ArticlePubMed