BDBM50093690 CHEMBL137356::Dimethyl-[1-(2-methyl-6-phenyl-5H-pyrrolo[3,2-d]pyrimidin-4-yl)-piperidin-2-ylmethyl]-amine
SMILES CN(C)CC1CCCCN1c1nc(C)nc2cc([nH]c12)-c1ccccc1
InChI Key InChIKey=DRPLTFIHCZOFME-UHFFFAOYSA-N
Data  1 IC50
  Tab Delimited (TSV)   2D SDfile   Computed 3D by Vconf -m prep SDfile
Find this compound or compounds like it in BindingDB:
Activity Spreadsheet -- Enzyme Inhibition Constant Data from BindingDB
Found 1 hit for monomerid = 50093690
TargetNeuropeptide Y receptor type 5(Homo sapiens (Human))
Amgen
Curated by ChEMBL
LigandPNGBDBM50093690(CHEMBL137356 | Dimethyl-[1-(2-methyl-6-phenyl-5H-p...)
Affinity DataIC50:  5.20E+3nM. Assay description: Affinity for human neuropeptide Y receptor Y5, binding was evaluated in an in vitro radioligand [125I]-PYY binding assay
In DepthDetails ArticlePubMed