BDBM50093705 4-Cyclohexyl-2-methyl-6-phenyl-5H-pyrrolo[3,2-d]pyrimidine::CHEMBL435825
SMILES Cc1nc(C2CCCCC2)c2[nH]c(cc2n1)-c1ccccc1
InChI Key InChIKey=PJPCROZWHDESGY-UHFFFAOYSA-N
Data  1 IC50
  Tab Delimited (TSV)   2D SDfile   Computed 3D by Vconf -m prep SDfile
Find this compound or compounds like it in BindingDB:
Activity Spreadsheet -- Enzyme Inhibition Constant Data from BindingDB
Found 1 hit for monomerid = 50093705
TargetNeuropeptide Y receptor type 5(Homo sapiens (Human))
Amgen
Curated by ChEMBL
LigandPNGBDBM50093705(4-Cyclohexyl-2-methyl-6-phenyl-5H-pyrrolo[3,2-d]py...)
Affinity DataIC50:  8.20E+3nM. Assay description: Affinity for human neuropeptide Y receptor Y5, binding was evaluated in an in vitro radioligand [125I]-PYY binding assay
In DepthDetails ArticlePubMed