BDBM50095359 5-[1-(2-Bromo-phenyl)-ethyl]-7-(6-morpholin-4-yl-pyridin-3-yl)-pyrido[2,3-d]pyrimidin-4-ylamine::CHEMBL168574
SMILES CC(c1ccccc1Br)c1cc(nc2ncnc(N)c12)-c1ccc(nc1)N1CCOCC1
InChI Key InChIKey=HHWKPCVJLZMIDJ-UHFFFAOYSA-N
Data  2 IC50
  Tab Delimited (TSV)   2D SDfile   Computed 3D by Vconf -m prep SDfile
Find this compound or compounds like it in BindingDB:
Activity Spreadsheet -- Enzyme Inhibition Constant Data from BindingDB
Found 2 hits for monomerid = 50095359
TargetAdenosine kinase(Rattus norvegicus (rat))
Abbott Laboratories
Curated by ChEMBL
LigandPNGBDBM50095359(5-[1-(2-Bromo-phenyl)-ethyl]-7-(6-morpholin-4-yl-p...)
Affinity DataIC50:  30nM. Assay description: Inhibitory activity against cytosolic adenosine kinase by ADO phosphorylation assay
In DepthDetails ArticlePubMed
TargetAdenosine kinase(Rattus norvegicus (rat))
Abbott Laboratories
Curated by ChEMBL
LigandPNGBDBM50095359(5-[1-(2-Bromo-phenyl)-ethyl]-7-(6-morpholin-4-yl-p...)
Affinity DataIC50:  0.25nM. Assay description: Inhibitory activity against cytosolic adenosine kinase by ADO phosphorylation assay
In DepthDetails ArticlePubMed