BDBM50095380 5-Furan-2-yl-7-(6-morpholin-4-yl-pyridin-3-yl)-pyrido[2,3-d]pyrimidin-4-ylamine::CHEMBL354370
SMILES Nc1ncnc2nc(cc(-c3ccco3)c12)-c1ccc(nc1)N1CCOCC1
InChI Key InChIKey=OBXNIAYZGVGZNG-UHFFFAOYSA-N
Data  2 IC50
  Tab Delimited (TSV)   2D SDfile   Computed 3D by Vconf -m prep SDfile
Find this compound or compounds like it in BindingDB:
Activity Spreadsheet -- Enzyme Inhibition Constant Data from BindingDB
Found 2 hits for monomerid = 50095380
TargetAdenosine kinase(Rattus norvegicus (rat))
Abbott Laboratories
Curated by ChEMBL
LigandPNGBDBM50095380(5-Furan-2-yl-7-(6-morpholin-4-yl-pyridin-3-yl)-pyr...)
Affinity DataIC50:  10nM. Assay description: Inhibitory activity against cytosolic adenosine kinase by ADO phosphorylation assay
In DepthDetails ArticlePubMed
TargetAdenosine kinase(Rattus norvegicus (rat))
Abbott Laboratories
Curated by ChEMBL
LigandPNGBDBM50095380(5-Furan-2-yl-7-(6-morpholin-4-yl-pyridin-3-yl)-pyr...)
Affinity DataIC50:  488nM. Assay description: Inhibitory activity against intact cell adenosine kinase by ADO phosphorylation assay
In DepthDetails ArticlePubMed