BDBM50097122 CHEMBL3580953
SMILES CC(C)c1cc(Nc2nc(nc3ccsc23)N2CCC(N)CC2)n[nH]1
InChI Key InChIKey=LQWHMCJXOYWKHQ-UHFFFAOYSA-N
Data  1 KI
  Tab Delimited (TSV)   2D SDfile   Computed 3D by Vconf -m prep SDfile
Find this compound or compounds like it in BindingDB:
Activity Spreadsheet -- Enzyme Inhibition Constant Data from BindingDB
Found 1 hit for monomerid = 50097122
TargetSerine/threonine-protein kinase PAK 1(Homo sapiens (Human))
Shanghai Chempartner
Curated by ChEMBL
LigandPNGBDBM50097122(CHEMBL3580953)
Affinity DataKi:  33nM. Assay description: Inhibition of human recombinant PAK1 kinase domain using coumarin/fluorescein-labeled FRET peptide as substrate assessed as substrate phosphorylation...
In DepthDetails ArticlePubMed