BDBM50100630 CHEMBL3321898
SMILES CCc1ccc(cc1)-c1nc2ccc(Nc3ncnc4ccccc34)cc2[nH]1
InChI Key InChIKey=AYSZCOGXVQBOMY-UHFFFAOYSA-N
Data  2 IC50
  Tab Delimited (TSV)   2D SDfile   Computed 3D by Vconf -m prep SDfile
Find this compound or compounds like it in BindingDB:
Activity Spreadsheet -- Enzyme Inhibition Constant Data from BindingDB
Found 2 hits for monomerid = 50100630
TargetVascular endothelial growth factor receptor 2(Homo sapiens (Human))
China Pharmaceutical University
Curated by ChEMBL
LigandPNGBDBM50100630(CHEMBL3321898)
Affinity DataIC50:  8.69E+3nM. Assay description: Inhibition of human recombinant VEGFR2 pre-incubated for 5 mins before ATP/substrate peptide cocktail addition measured after 30 mins by colorimetric...
In DepthDetails ArticlePubMed
TargetHepatocyte growth factor receptor(Homo sapiens (Human))
China Pharmaceutical University
Curated by ChEMBL
LigandPNGBDBM50100630(CHEMBL3321898)
Affinity DataIC50:  7.30E+3nM. Assay description: Inhibition of human recombinant c-Met pre-incubated for 5 mins before ATP/substrate peptide cocktail addition measured after 30 mins by colorimetric ...
In DepthDetails ArticlePubMed