BDBM50102436 Ac-D-Nal-[D-(pCl)Phe]-D-Pal-Ser-[Aph(Hor)]-D-Nal-Leu-ILys-Pro-DAla-NH2::CHEMBL435925
SMILES CC(C)C[C@H](NC(=O)[C@@H](Cc1ccc2ccccc2c1)NC(=O)[C@H](Cc1ccc(NC(=O)[C@H]2CC(=O)NC(=O)N2)cc1)NC(=O)[C@H](CO)NC(=O)[C@@H](Cc1cccnc1)NC(=O)[C@@H](Cc1ccc(Cl)cc1)NC(=O)[C@@H](Cc1ccc2ccccc2c1)NC(C)=O)C(=O)N[C@@H](CCCCNC(C)C)C(=O)N1CCC[C@H]1C(=O)N[C@H](C)C(N)=O
InChI Key InChIKey=KLRCCGMUXUEWGH-YOUGEYMXSA-N
Data  1 IC50
  Tab Delimited (TSV)   2D SDfile   Computed 3D by Vconf -m prep SDfile
Find this compound or compounds like it in BindingDB:
Activity Spreadsheet -- Enzyme Inhibition Constant Data from BindingDB
Found 1 hit for monomerid = 50102436
TargetGonadotropin-releasing hormone receptor(Homo sapiens (Human))
Ferring Research Institute
Curated by ChEMBL
LigandPNGBDBM50102436(Ac-D-Nal-[D-(pCl)Phe]-D-Pal-Ser-[Aph(Hor)]-D-Nal-L...)
Affinity DataIC50:  13nM. Assay description: Antagonism of human GnHR receptor, determined in a reporter gene assay in HEK293 cells
In DepthDetails ArticlePubMed