BDBM50102928 5-(3-Bromo-phenyl)-7-(6-thiomorpholin-4-yl-pyridin-3-yl)-pyrido[2,3-d]pyrimidin-4-ylamine::CHEMBL62576
SMILES Nc1ncnc2nc(cc(-c3cccc(Br)c3)c12)-c1ccc(nc1)N1CCSCC1
InChI Key InChIKey=GAIAFXMADQXMPG-UHFFFAOYSA-N
Data  2 IC50
  Tab Delimited (TSV)   2D SDfile   Computed 3D by Vconf -m prep SDfile
Find this compound or compounds like it in BindingDB:
Activity Spreadsheet -- Enzyme Inhibition Constant Data from BindingDB
Found 2 hits for monomerid = 50102928
TargetAdenosine kinase(Homo sapiens (Human))
Abbott Laboratories
Curated by ChEMBL
LigandPNGBDBM50102928(5-(3-Bromo-phenyl)-7-(6-thiomorpholin-4-yl-pyridin...)
Affinity DataIC50:  1.30nM. Assay description: In vitro concentration required for 50% inhibition against Adenosine Kinase (AK) in the presence of intact cells
In DepthDetails ArticlePubMed
TargetAdenosine kinase(Homo sapiens (Human))
Abbott Laboratories
Curated by ChEMBL
LigandPNGBDBM50102928(5-(3-Bromo-phenyl)-7-(6-thiomorpholin-4-yl-pyridin...)
Affinity DataIC50:  43nM. Assay description: In vitro concentration required for 50% inhibition against Adenosine Kinase (AK) in the presence of intact cells
In DepthDetails ArticlePubMed