BDBM50106627 CHEMBL3600764
SMILES CCN1\C(=C\C=C\C2=[N+](CC)c3ccc(cc3C2(C)C)S(O)(=O)=O)C(C)(CCCC(=O)NCCCC[C@@H](NC(=O)[C@@H](CCCNC(N)=N)NC(=O)[C@@H](CCCNC(N)=N)NC(=O)[C@@H](CCCNC(N)=N)NC(=O)[C@@H](CCCNC(N)=N)NC(=O)[C@@H](CCCNC(N)=N)NC(=O)[C@@H](CCCNC(N)=N)NC(=O)[C@H](Cc2ccc(cc2)N=[N+]=[N-])NC(=O)[C@H](Cc2ccc(cc2)N=[N+]=[N-])NC(=O)CCNC(=O)[C@@]2(Cc3cccc(Nc4nccs4)n3)CC[C@@H](CC2)Oc2cccc(Cl)c2F)C(N)=O)c2cc(ccc12)S(O)(=O)=O
InChI Key InChIKey=PUPTXCZKZNDECK-RSSQFEJJSA-O
Data  1 Kd
  Tab Delimited (TSV)   2D SDfile   Computed 3D by Vconf -m prep SDfile
Find this compound or compounds like it in BindingDB:
Activity Spreadsheet -- Enzyme Inhibition Constant Data from BindingDB
Found 1 hit for monomerid = 50106627
TargetAurora kinase A(Homo sapiens (Human))
University Of Tartu
Curated by ChEMBL
LigandPNGBDBM50106627(CHEMBL3600764)
Affinity DataKd:  5.70nM. Assay description: Binding affinity to purified recombinant full-length Aurora A (unknown origin) by fluorescence polarisation/anisotropy based equilibrium binding assa...
In DepthDetails ArticlePubMed