BDBM50106683 9-(5,6-Diphenyl-pyridazin-3-ylsulfanyl)-nonanoic acid::CHEMBL135317
SMILES OC(=O)CCCCCCCCSc1cc(-c2ccccc2)c(nn1)-c1ccccc1
InChI Key InChIKey=GIXJHHLSOXFOOP-UHFFFAOYSA-N
Data  1 IC50
  Tab Delimited (TSV)   2D SDfile   Computed 3D by Vconf -m prep SDfile
Find this compound or compounds like it in BindingDB:
Activity Spreadsheet -- Enzyme Inhibition Constant Data from BindingDB
Found 1 hit for monomerid = 50106683
TargetSterol O-acyltransferase 1(Rattus norvegicus)
Università
Curated by ChEMBL
LigandPNGBDBM50106683(9-(5,6-Diphenyl-pyridazin-3-ylsulfanyl)-nonanoic a...)
Affinity DataIC50: >3.00E+5nM. Assay description: In vitro acyl-coenzyme A:cholesterol acyltransferase inhibition in rat liver microsomes
In DepthDetails ArticlePubMed