BDBM50108507 CHEMBL420797::dodecanoic anhydride
SMILES CCCCCCCCCCCC(=O)OC(=O)CCCCCCCCCCC
InChI Key InChIKey=NWADXBLMWHFGGU-UHFFFAOYSA-N
Data  2 IC50
  Tab Delimited (TSV)   2D SDfile   Computed 3D by Vconf -m prep SDfile
Find this compound or compounds like it in BindingDB:
Activity Spreadsheet -- Enzyme Inhibition Constant Data from BindingDB
Found 2 hits for monomerid = 50108507
TargetProtein farnesyltransferase subunit beta/geranylgeranyltransferase type-1 subunit alpha(Homo sapiens (Human))
University College London
Curated by ChEMBL
LigandPNGBDBM50108507(CHEMBL420797 | dodecanoic anhydride)
Affinity DataIC50:  8.54E+5nM. Assay description: In vitro inhibition of farnesyl-protein transferase
In DepthDetails ArticlePubMed
LigandPNGBDBM50108507(CHEMBL420797 | dodecanoic anhydride)
Affinity DataIC50:  2.29E+5nM. Assay description: In vitro inhibition of geranylgeranyl-protein transferase type-I
In DepthDetails ArticlePubMed