BDBM50114075 CHEMBL3603956
SMILES CN[C@H](C)Cc1ccc2OCCOc2c1
InChI Key InChIKey=UJKWLAZYSLJTKA-SECBINFHSA-N
Data  2 EC50
  Tab Delimited (TSV)   2D SDfile   Computed 3D by Vconf -m prep SDfile
Find this compound or compounds like it in BindingDB:
Activity Spreadsheet -- Enzyme Inhibition Constant Data from BindingDB
Found 2 hits for monomerid = 50114075
TargetSodium-dependent serotonin transporter(Rattus norvegicus (rat))
Virginia Commonwealth University
Curated by ChEMBL
LigandPNGBDBM50114075(CHEMBL3603956)
Affinity DataEC50:  573nM. Assay description: Binding affinity to SERT in Sprague-Dawley rat brain synaptosomes assessed as induction of [3H]5-HT release by liquid scintillation counting method
In DepthDetails ArticlePubMed
TargetSodium-dependent dopamine transporter(Rattus norvegicus (rat))
Virginia Commonwealth University
Curated by ChEMBL
LigandPNGBDBM50114075(CHEMBL3603956)
Affinity DataEC50:  1.46E+4nM. Assay description: Binding affinity to DAT in Sprague-Dawley rat brain synaptosomes assessed as induction of [3H]MPP+ release by liquid scintillation counting method
In DepthDetails ArticlePubMed