BDBM50114953 2-(3,5-Bis-trifluoromethyl-phenyl)-N-(4-dimethylamino-1-phenyl-cyclohexyl)-propionamide::CHEMBL3085125
SMILES CC(C(=O)N[C@@]1(CC[C@@H](CC1)N(C)C)c1ccccc1)c1cc(cc(c1)C(F)(F)F)C(F)(F)F
InChI Key InChIKey=MREQKXYHVPWIQW-NLPFKWBYSA-N
Data  1 KI  1 IC50
  Tab Delimited (TSV)   2D SDfile   Computed 3D by Vconf -m prep SDfile
Find this compound or compounds like it in BindingDB:
Activity Spreadsheet -- Enzyme Inhibition Constant Data from BindingDB
Found 2 hits for monomerid = 50114953
TargetPotassium voltage-gated channel subfamily H member 2(Homo sapiens (Human))
Merck Sharp & Dohme Research Laboratories
Curated by ChEMBL
LigandPNGBDBM50114953(2-(3,5-Bis-trifluoromethyl-phenyl)-N-(4-dimethylam...)
Affinity DataKi:  1.90E+3nM. Assay description: Compound was evaluated for the displacement of labelled MK-499 from the cloned channel expressed in HEK cells (Ikrchannel)
In DepthDetails ArticlePubMed
TargetSubstance-P receptor(Homo sapiens (Human))
Merck Sharp & Dohme Research Laboratories
Curated by ChEMBL
LigandPNGBDBM50114953(2-(3,5-Bis-trifluoromethyl-phenyl)-N-(4-dimethylam...)
Affinity DataIC50:  22nM. Assay description: Displacement of [125 I] -labelled substance P from the cloned Tachykinin receptor 1 expressed in CHO cells
In DepthDetails ArticlePubMed