BDBM50115490 CHEMBL3608990
SMILES NC(=O)c1ccc(Cl)s1
InChI Key InChIKey=OMOBWMBJNNCUFO-UHFFFAOYSA-N
Data  1 KI  2 Kd
PDB links: 1 PDB ID matches this monomer.
  Tab Delimited (TSV)   2D SDfile   Computed 3D by Vconf -m prep SDfile
Find this compound or compounds like it in BindingDB:
Activity Spreadsheet -- Enzyme Inhibition Constant Data from BindingDB
Found 3 hits for monomerid = 50115490
TargetProthrombin(Homo sapiens (Human))
Philipps University Marburg
Curated by ChEMBL
LigandPNGBDBM50115490(CHEMBL3608990)
Affinity DataKi:  4.31E+5nM. Assay description: Binding affinity to thrombin (unknown origin)
TargetProthrombin(Homo sapiens (Human))
Philipps University Marburg
Curated by ChEMBL
LigandPNGBDBM50115490(CHEMBL3608990)
Affinity DataKd:  5.07E+5nM. Assay description: Binding affinity to thrombin (unknown origin) by displacement titration based isothermal titration colorimetry
TargetProthrombin(Homo sapiens (Human))
Philipps University Marburg
Curated by ChEMBL
LigandPNGBDBM50115490(CHEMBL3608990)
Affinity DataKd:  4.75E+5nM. Assay description: Binding affinity to thrombin (unknown origin) by direct isothermal titration colorimetry