BDBM50122805 1-(2-{4-[1-(4-Fluoro-phenyl)-5-(2-methyl-2H-[1,2,3]triazol-4-yl)-1H-indol-3-yl]-piperidin-1-yl}-ethyl)-imidazolidin-2-one::CHEMBL328940
SMILES Cn1ncc(n1)-c1ccc2n(cc(C3CCN(CCN4CCNC4=O)CC3)c2c1)-c1ccc(F)cc1
InChI Key InChIKey=WOYBCGRCOVCAFT-UHFFFAOYSA-N
Data  5 KI
  Tab Delimited (TSV)   2D SDfile   Computed 3D by Vconf -m prep SDfile
Find this compound or compounds like it in BindingDB:
Activity Spreadsheet -- Enzyme Inhibition Constant Data from BindingDB
Found 5 hits for monomerid = 50122805
Target5-hydroxytryptamine receptor 2A(Rattus norvegicus (rat))
H. Lundbeck
Curated by ChEMBL
LigandPNGBDBM50122805(1-(2-{4-[1-(4-Fluoro-phenyl)-5-(2-methyl-2H-[1,2,3...)
Affinity DataKi:  43nM. Assay description: Displacement of [3H]ketanserin (0.5 nM) from rat cerebral cortex 5-hydroxytryptamine 2A receptors
In DepthDetails ArticlePubMed
Target5-hydroxytryptamine receptor 1B(Homo sapiens (Human))
H. Lundbeck
Curated by ChEMBL
LigandPNGBDBM50122805(1-(2-{4-[1-(4-Fluoro-phenyl)-5-(2-methyl-2H-[1,2,3...)
Affinity DataKi:  67nM. Assay description: Ability to displace [3H]5-CT (1.5 nM) from HeLa cells of human 5-hydroxytryptamine 1B receptor
In DepthDetails ArticlePubMed
Target5-hydroxytryptamine receptor 2C(Rattus norvegicus (Rat))
H. Lundbeck
Curated by ChEMBL
LigandPNGBDBM50122805(1-(2-{4-[1-(4-Fluoro-phenyl)-5-(2-methyl-2H-[1,2,3...)
Affinity DataKi:  73nM. Assay description: Displacement of [3H]mesulergine (0.5 nM) from rat 5-hydroxytryptamine 2C receptor expressed in SR-3T3 cells
In DepthDetails ArticlePubMed
TargetD(2) dopamine receptor(Rattus norvegicus (rat))
H. Lundbeck
Curated by ChEMBL
LigandPNGBDBM50122805(1-(2-{4-[1-(4-Fluoro-phenyl)-5-(2-methyl-2H-[1,2,3...)
Affinity DataKi:  86nM. Assay description: Displacement of [3H]spiperone (0.5 nM) from rat corpus striatum dopamine D2 receptor
In DepthDetails ArticlePubMed
Target5-hydroxytryptamine receptor 1A(Homo sapiens (Human))
H. Lundbeck
Curated by ChEMBL
LigandPNGBDBM50122805(1-(2-{4-[1-(4-Fluoro-phenyl)-5-(2-methyl-2H-[1,2,3...)
Affinity DataKi:  290nM. Assay description: Ability to displace [3H]5-CT (2.0 nM) from HeLa cells of human 5-hydroxytryptamine 1A receptor
In DepthDetails ArticlePubMed