BDBM50128113 1-[3-(4-Chloro-phenoxy)-butyl]-4-methyl-piperidine; hydrochloride::CHEMBL555090
SMILES C[C@H](CCN1CCC(C)CC1)Oc1ccc(Cl)cc1
InChI Key InChIKey=MAWYSOMSMVYISQ-CQSZACIVSA-N
Data  2 KI
  Tab Delimited (TSV)   2D SDfile   Computed 3D by Vconf -m prep SDfile
Find this compound or compounds like it in BindingDB:
Activity Spreadsheet -- Enzyme Inhibition Constant Data from BindingDB
Found 2 hits for monomerid = 50128113
TargetSigma non-opioid intracellular receptor 1(Homo sapiens (Human))
Universit£
Curated by ChEMBL
LigandPNGBDBM50128113(1-[3-(4-Chloro-phenoxy)-butyl]-4-methyl-piperidine...)
Affinity DataKi:  1.40nM. Assay description: Inhibition of [3H]pentazocine binding to Sigma receptor type 1 in guinea pig brain membrane without cerebellum
In DepthDetails ArticlePubMed
Target3-beta-hydroxysteroid-Delta(8),Delta(7)-isomerase(Cavia porcellus)
Universit£
Curated by ChEMBL
LigandPNGBDBM50128113(1-[3-(4-Chloro-phenoxy)-butyl]-4-methyl-piperidine...)
Affinity DataKi:  30.1nM. Assay description: Inhibition of [3H]-emopamil binding to Sterol delta 8-delta 7 isomerase in guinea pig liver membrane
In DepthDetails ArticlePubMed