BDBM50129277 CHEMBL3629739::US9464103, (6aR,10aS)-10a-(4-chlorobenzenesulfonyl)-1,4-difluoro-6',6'-dimethyl-6,6a,8,9,10,10a-hexahydrospiro[benzo[c]isochromene-7,3'-[1,5]dioxane]
SMILES Fc1ccc(F)c2c1OC[C@H]1C3(COC3)CCC[C@@]21S(=O)(=O)c1ccc(Cl)cc1
InChI Key InChIKey=OHQWUKZYZSMZAC-UWJYYQICSA-N
Data  4 IC50
  Tab Delimited (TSV)   2D SDfile   Computed 3D by Vconf -m prep SDfile
Find this compound or compounds like it in BindingDB:
Activity Spreadsheet -- Enzyme Inhibition Constant Data from BindingDB
Found 4 hits for monomerid = 50129277
TargetAmyloid-beta precursor protein [672-711](Homo sapiens (Human))
Merck Sharp & Dohme
US Patent
LigandPNGBDBM50129277(CHEMBL3629739 | US9464103, (6aR,10aS)-10a-(4-chlor...)
Affinity DataIC50:  10.1nMpH: 7.0Assay Description:To measure γ-secretase activity, membranes were incubated at 37° C. for 1 h in 50 μL of buffer containing 20 mM Hepes (pH 7.0) and 2 mM EDT...
In DepthDetails US Patent
LigandPNGBDBM50129277(CHEMBL3629739 | US9464103, (6aR,10aS)-10a-(4-chlor...)
Affinity DataIC50:  7nM. Assay description: Inhibition of gamma-secretase in HEK293 cells using human APP Swedish/London double mutant as substrate assessed as formation of amyloid beta 42 afte...
In DepthDetails ArticlePubMed
LigandPNGBDBM50129277(CHEMBL3629739 | US9464103, (6aR,10aS)-10a-(4-chlor...)
Affinity DataIC50:  13nM. Assay description: Inhibition of gamma-secretase in HEK293 cells using human APP Swedish/London double mutant as substrate assessed as formation of amyloid beta 40 afte...
In DepthDetails ArticlePubMed
LigandPNGBDBM50129277(CHEMBL3629739 | US9464103, (6aR,10aS)-10a-(4-chlor...)
Affinity DataIC50:  10nM. Assay description: Inhibition of gamma-secretase in HEK293 cell membranes using SPC99-Lon as substrate assessed as formation of amyloid beta 40 after 1 hr by electroche...
In DepthDetails ArticlePubMed