BDBM50130553 2,2-Dimethyl-propionic acid 2-(3,4-dimethyl-benzyl)-3-[3-(4-ethanesulfonylamino-benzyl)-thioureido]-propyl ester::CHEMBL104661
SMILES CCS(=O)(=O)Nc1ccc(CNC(=S)NCC(COC(=O)C(C)(C)C)Cc2ccc(C)c(C)c2)cc1
InChI Key InChIKey=MPBWGJRKSGZDLO-UHFFFAOYSA-N
Data  2 KI
  Tab Delimited (TSV)   2D SDfile   Computed 3D by Vconf -m prep SDfile
Find this compound or compounds like it in BindingDB:
Activity Spreadsheet -- Enzyme Inhibition Constant Data from BindingDB
Found 2 hits for monomerid = 50130553
TargetTransient receptor potential cation channel subfamily V member 1(Rattus norvegicus (rat))
Seoul National University
Curated by ChEMBL
LigandPNGBDBM50130553(2,2-Dimethyl-propionic acid 2-(3,4-dimethyl-benzyl...)
Affinity DataKi:  108nM. Assay description: In vitro binding affinity towards Rat Vanilloid receptor 1 (VR1) by [3H]-RTX displacement.
In DepthDetails ArticlePubMed
TargetTransient receptor potential cation channel subfamily V member 1(Rattus norvegicus (rat))
Seoul National University
Curated by ChEMBL
LigandPNGBDBM50130553(2,2-Dimethyl-propionic acid 2-(3,4-dimethyl-benzyl...)
Affinity DataKi:  309nM. Assay description: Inhibition of capsaicin-induced [Ca2+] uptake by Rat Vanilloid receptor 1 (VR1) expressing CHO cells
In DepthDetails ArticlePubMed