BDBM50132387 (7-Methoxy-quinoxalin-2-yl)-phenyl-amine::CHEMBL104087
SMILES COc1ccc2ncc(Nc3ccccc3)nc2c1
InChI Key InChIKey=PVGFBLHZPWPMFD-UHFFFAOYSA-N
Data  1 IC50
  Tab Delimited (TSV)   2D SDfile   Computed 3D by Vconf -m prep SDfile
Find this compound or compounds like it in BindingDB:
Activity Spreadsheet -- Enzyme Inhibition Constant Data from BindingDB
Found 1 hit for monomerid = 50132387
TargetPlatelet-derived growth factor receptor alpha/beta(Homo sapiens (Human))
Aventis Pharmaceuticals
Curated by ChEMBL
LigandPNGBDBM50132387((7-Methoxy-quinoxalin-2-yl)-phenyl-amine | CHEMBL1...)
Affinity DataIC50:  42nM. Assay description: Inhibition of Platelet-derived growth factor receptor
In DepthDetails ArticlePubMed