BDBM50132967 CHEMBL432607::[8-(2,4-Dichloro-phenyl)-2,7-dimethyl-quinolin-4-yl]-dipropyl-amine
SMILES CCCN(CCC)c1cc(C)nc2c(c(C)ccc12)-c1ccc(Cl)cc1Cl
InChI Key InChIKey=GEVSQUIJCIWUSL-UHFFFAOYSA-N
Data  1 KI
  Tab Delimited (TSV)   2D SDfile   Computed 3D by Vconf -m prep SDfile
Find this compound or compounds like it in BindingDB:
Activity Spreadsheet -- Enzyme Inhibition Constant Data from BindingDB
Found 1 hit for monomerid = 50132967
TargetCorticotropin-releasing factor receptor 1(Homo sapiens (Human))
Neurocrine Biosciences
Curated by ChEMBL
LigandPNGBDBM50132967(CHEMBL432607 | [8-(2,4-Dichloro-phenyl)-2,7-dimeth...)
Affinity DataKi:  4.5nM. Assay description: Binding affinity towards cloned human Corticotropin releasing factor receptor 1 expressed in CHO cells using [125I]-o-CRF as the radioligand
In DepthDetails ArticlePubMed