BDBM50135066 Benzoic acid 1-(2,6-diamino-hexanoyl)-pyrrolidin-3-yl ester::CHEMBL145855
SMILES NCCCCC(N)C(=O)N1CCC(C1)OC(=O)c1ccccc1
InChI Key InChIKey=AFEZJQWQIKOSCC-UHFFFAOYSA-N
Data  2 IC50
  Tab Delimited (TSV)   2D SDfile   Computed 3D by Vconf -m prep SDfile
Find this compound or compounds like it in BindingDB:
Activity Spreadsheet -- Enzyme Inhibition Constant Data from BindingDB
Found 2 hits for monomerid = 50135066
TargetDipeptidyl peptidase 4(Homo sapiens (Human))
University Of Antwerp (Uia)
Curated by ChEMBL
LigandPNGBDBM50135066(Benzoic acid 1-(2,6-diamino-hexanoyl)-pyrrolidin-3...)
Affinity DataIC50: >1.00E+6nM. Assay description: Inhibitory activity against Dipeptidylpeptidase IV (DPP IV)
In DepthDetails ArticlePubMed
TargetDipeptidyl peptidase 2(Homo sapiens (Human))
University Of Antwerp (Uia)
Curated by ChEMBL
LigandPNGBDBM50135066(Benzoic acid 1-(2,6-diamino-hexanoyl)-pyrrolidin-3...)
Affinity DataIC50:  7.81E+4nM. Assay description: Inhibitory activity of compound against Dipeptidylpeptidase II (DPP II)
In DepthDetails ArticlePubMed