BDBM50138976 (2S)-4-[((2S)-2-amino-5-{[(E)-imino(nitroamino)methyl]amino}pentanoyl)amino]pyrrolidine-2-carboxamide; ditrifluoroacetic acid::CHEMBL161297
SMILES N[C@@H](CCCNC(=N)N[N+]([O-])=O)C(=O)N[C@H]1CN[C@@H](C1)C(N)=O
InChI Key InChIKey=IUFRDGFKAVLPFZ-CSMHCCOUSA-N
Data  2 KI  3 IC50
PDB links: 6 PDB IDs match this monomer.
  Tab Delimited (TSV)   2D SDfile   Computed 3D by Vconf -m prep SDfile
Find this compound or compounds like it in BindingDB:
Activity Spreadsheet -- Enzyme Inhibition Constant Data from BindingDB
Found 5 hits for monomerid = 50138976
TargetNitric oxide synthase, brain(Rattus norvegicus (rat))
Northwestern University
Curated by ChEMBL
LigandPNGBDBM50138976((2S)-4-[((2S)-2-amino-5-{[(E)-imino(nitroamino)met...)
Affinity DataKi:  100nM. Assay description: Binding affinity towards neuronal nitric oxide synthase (nNOS)
TargetNitric oxide synthase, endothelial(Bos taurus (bovine))
Northwestern University
Curated by ChEMBL
LigandPNGBDBM50138976((2S)-4-[((2S)-2-amino-5-{[(E)-imino(nitroamino)met...)
Affinity DataKi:  1.28E+5nM. Assay description: Binding affinity towards endothelial nitric oxide synthase (eNOS)
TargetNitric oxide synthase, endothelial(Bos taurus (bovine))
Northwestern University
Curated by ChEMBL
LigandPNGBDBM50138976((2S)-4-[((2S)-2-amino-5-{[(E)-imino(nitroamino)met...)
Affinity DataIC50:  8.80E+5nM. Assay description: Inhibitory activity against endothelial nitric oxide synthase (eNOS)
TargetNitric oxide synthase, inducible(Mus musculus (mouse))
Northwestern University
Curated by ChEMBL
LigandPNGBDBM50138976((2S)-4-[((2S)-2-amino-5-{[(E)-imino(nitroamino)met...)
Affinity DataIC50:  2.90E+4nM. Assay description: Binding affinity towards inducible nitric oxide synthase (iNOS)
In DepthDetails ArticlePubMed
TargetNitric oxide synthase, brain(Rattus norvegicus (rat))
Northwestern University
Curated by ChEMBL
LigandPNGBDBM50138976((2S)-4-[((2S)-2-amino-5-{[(E)-imino(nitroamino)met...)
Affinity DataIC50:  640nM. Assay description: Inhibitory activity against neuronal nitric oxide synthase (nNOS)