BDBM50139787 (3S)-3-amino-3-{[(1S)-1-{[(1S)-1-{[(2S)-4-({[(2S)-1-[(2S)-2-{[(1S)-1-carboxy-2-phenylethyl]carbamoyl}pyrrolidin-1-yl]-3-(1H-imidazol-4-yl)-1-oxopropan-2-yl]carbamoyl}methyl)-2-[(4-hydroxyphenyl)methyl]-3-oxo-2,3,4,5-tetrahydro-1H-1,4-benzodiazepin-7-yl]carbamoyl}-2-methylpropyl]carbamoyl}-4-[(diaminomethylidene)amino]butyl]carbamoyl}propanoic acid::Angiotensin II analogue::CHEMBL414478
SMILES CC(C)[C@H](NC(=O)[C@H](CCCNC(N)=N)NC(=O)[C@@H](N)CC(O)=O)C(=O)Nc1ccc2N[C@@H](Cc3ccc(O)cc3)C(=O)N(CC(=O)N[C@@H](Cc3cnc[nH]3)C(=O)N3CCC[C@H]3C(=O)N[C@@H](Cc3ccccc3)C(O)=O)Cc2c1
InChI Key InChIKey=FVKAGOPTDOJBBC-QKRFPXMZSA-N
Data  2 KI
  Tab Delimited (TSV)   2D SDfile   Computed 3D by Vconf -m prep SDfile
Find this compound or compounds like it in BindingDB:
Activity Spreadsheet -- Enzyme Inhibition Constant Data from BindingDB
Found 2 hits for monomerid = 50139787
TargetType-2 angiotensin II receptor(Homo sapiens (Human))
Uppsala University
Curated by ChEMBL
LigandPNGBDBM50139787((3S)-3-amino-3-{[(1S)-1-{[(1S)-1-{[(2S)-4-({[(2S)-...)
Affinity DataKi:  3nM. Assay description: Displacement of [125I]-Ang II from angiotensin II receptor type 2 in pig uterus myometrium
In DepthDetails ArticlePubMed
TargetType-2 angiotensin II receptor(Homo sapiens (Human))
Uppsala University
Curated by ChEMBL
LigandPNGBDBM50139787((3S)-3-amino-3-{[(1S)-1-{[(1S)-1-{[(2S)-4-({[(2S)-...)
Affinity DataKi:  3nM. Assay description: Binding affinity for Angiotensin II receptor type 2 using [125I]- Ang II in pig uterus myometrium
In DepthDetails ArticlePubMed