BDBM50140096 1-(2,6-Difluoro-benzyl)-5-(2-fluoro-3-methoxy-phenyl)-6-methyl-3-{2-[methyl-(2-pyridin-2-yl-ethyl)-amino]-ethyl}-1H-pyrimidine-2,4-dione::CHEMBL417645
SMILES COc1cccc(c1F)-c1c(C)n(Cc2c(F)cccc2F)c(=O)n(CCN(C)CCc2ccccn2)c1=O
InChI Key InChIKey=ADYYHGJMWPGLSW-UHFFFAOYSA-N
Data  1 KI
  Tab Delimited (TSV)   2D SDfile   Computed 3D by Vconf -m prep SDfile
Find this compound or compounds like it in BindingDB:
Activity Spreadsheet -- Enzyme Inhibition Constant Data from BindingDB
Found 1 hit for monomerid = 50140096
TargetGonadotropin-releasing hormone receptor(Homo sapiens (Human))
Neurocrine Biosciences
Curated by ChEMBL
LigandPNGBDBM50140096(1-(2,6-Difluoro-benzyl)-5-(2-fluoro-3-methoxy-phen...)
Affinity DataKi:  3nM. Assay description: Binding affinity evaluated by the ability to inhibit des-Gly10[125I]Tyr5,D-Leu6,NMeLeu7,Pro9-NEt]- Gonadotropin-releasing hormone binding to cloned h...
In DepthDetails ArticlePubMed