BDBM50146952 2-(S)-Amino-4-(4-benzyloxy-benzylamino)-1-piperidin-1-yl-butan-1-one::CHEMBL99247
SMILES N[C@@H](CCNCc1ccc(OCc2ccccc2)cc1)C(=O)N1CCCCC1
InChI Key InChIKey=XMSUGULXHOJTAJ-QFIPXVFZSA-N
Data  2 IC50
  Tab Delimited (TSV)   2D SDfile   Computed 3D by Vconf -m prep SDfile
Find this compound or compounds like it in BindingDB:
Activity Spreadsheet -- Enzyme Inhibition Constant Data from BindingDB
Found 2 hits for monomerid = 50146952
TargetDipeptidyl peptidase 4(Homo sapiens (Human))
University Of Antwerp
Curated by ChEMBL
LigandPNGBDBM50146952(2-(S)-Amino-4-(4-benzyloxy-benzylamino)-1-piperidi...)
Affinity DataIC50:  1.92E+5nM. Assay description: Inhibition of human Dipeptidyl-peptidase IV (DPP IV)
In DepthDetails ArticlePubMed
TargetDipeptidyl peptidase 2(Homo sapiens (Human))
University Of Antwerp
Curated by ChEMBL
LigandPNGBDBM50146952(2-(S)-Amino-4-(4-benzyloxy-benzylamino)-1-piperidi...)
Affinity DataIC50:  0.410nM. Assay description: Inhibition of human Dipeptidyl-peptidase II (DPP II)
In DepthDetails ArticlePubMed