BDBM50147220 4-{2-[1-[4-(2-fluorophenylcarboxamido)benzoyl]spiro[2,3,4,5-tetrahydro-1H-benzo[b]azepine-4,1'-(2'-cyclopentene)]-3-ylcarboxamido]ethyl}-1,4-oxazinane::CHEMBL316736
SMILES Fc1ccccc1C(=O)Nc1ccc(cc1)C(=O)N1CCC2(CCC(=C2)C(=O)NCCN2CCOCC2)Cc2ccccc12
InChI Key InChIKey=PAMHNAPDSHMZAM-UHFFFAOYSA-N
Data  3 IC50
  Tab Delimited (TSV)   2D SDfile   Computed 3D by Vconf -m prep SDfile
Find this compound or compounds like it in BindingDB:
Activity Spreadsheet -- Enzyme Inhibition Constant Data from BindingDB
Found 3 hits for monomerid = 50147220
TargetVasopressin V1a receptor(Homo sapiens (Human))
Johnson And Johnson Pharmaceutical Research And Development
Curated by ChEMBL
LigandPNGBDBM50147220(4-{2-[1-[4-(2-fluorophenylcarboxamido)benzoyl]spir...)
Affinity DataIC50:  4nM. Assay description: Binding affinity measured by inhibition of 3[H] AVP binding to cloned human vasopressin V1a receptor
In DepthDetails ArticlePubMed
TargetVasopressin V2 receptor(Homo sapiens (Human))
Johnson And Johnson Pharmaceutical Research And Development
Curated by ChEMBL
LigandPNGBDBM50147220(4-{2-[1-[4-(2-fluorophenylcarboxamido)benzoyl]spir...)
Affinity DataIC50: >1.00E+3nM. Assay description: Binding affinity measured by inhibition of 3[H] AVP binding to cloned human vasopressin V2 receptor
In DepthDetails ArticlePubMed
TargetVasopressin V1a receptor(Homo sapiens (Human))
Johnson And Johnson Pharmaceutical Research And Development
Curated by ChEMBL
LigandPNGBDBM50147220(4-{2-[1-[4-(2-fluorophenylcarboxamido)benzoyl]spir...)
Affinity DataIC50:  227nM. Assay description: Evaluated for intracellular calcium mobilization in HEK293 cells transfected to express human vasopressin V1a receptor
In DepthDetails ArticlePubMed