BDBM50149550 CHEMBL3770332
SMILES COC(=O)Nc1ccc2-c3sc(cc3CCOc2c1)-c1nncn1-c1ccccc1Cl
InChI Key InChIKey=IMSBGZSMSGCJBM-UHFFFAOYSA-N
Data  1 KI
PDB links: 1 PDB ID matches this monomer.
  Tab Delimited (TSV)   2D SDfile   Computed 3D by Vconf -m prep SDfile
Find this compound or compounds like it in BindingDB:
Activity Spreadsheet -- Enzyme Inhibition Constant Data from BindingDB
Found 1 hit for monomerid = 50149550
LigandPNGBDBM50149550(CHEMBL3770332)
Affinity DataKi:  1nM. Assay description: Inhibition of recombinant PI3K alpha (unknown origin) using PIP2 as substrate by fluorescence polarization assay