BDBM50149954 CHEMBL3770408
SMILES C[C@@H](NC(=O)OCC(F)(F)C(F)(F)C(F)(F)F)c1nc2ccc(F)cc2s1
InChI Key InChIKey=JBZYNUVBPMFUDV-MUUNZHRXSA-N
Data  2 IC50
  Tab Delimited (TSV)   2D SDfile   Computed 3D by Vconf -m prep SDfile
Find this compound or compounds like it in BindingDB:
Activity Spreadsheet -- Enzyme Inhibition Constant Data from BindingDB
Found 2 hits for monomerid = 50149954
TargetCholinesterase(Equus caballus (Horse))
University Of Pardubice
Curated by ChEMBL
LigandPNGBDBM50149954(CHEMBL3770408)
Affinity DataIC50:  7.45E+4nM. Assay description: Inhibition of equine serum BChE by spectrophotometric-based Ellman's method
In DepthDetails ArticlePubMed
TargetAcetylcholinesterase(Electrophorus electricus (Electric eel))
University Of Pardubice
Curated by ChEMBL
LigandPNGBDBM50149954(CHEMBL3770408)
Affinity DataIC50:  8.19E+4nM. Assay description: Inhibition of electric eel AChE by spectrophotometric-based Ellman's method
In DepthDetails ArticlePubMed