BDBM50150060 CHEMBL3775692
SMILES Cc1cc(=O)n(C)c2cc(NS(C)(=O)=O)ccc12
InChI Key InChIKey=LJTKZAIXTKZSBU-UHFFFAOYSA-N
Data  1 Kd
PDB links: 1 PDB ID matches this monomer.
  Tab Delimited (TSV)   2D SDfile   Computed 3D by Vconf -m prep SDfile
Find this compound or compounds like it in BindingDB:
Activity Spreadsheet -- Enzyme Inhibition Constant Data from BindingDB
Found 1 hit for monomerid = 50150060
TargetHistone acetyltransferase KAT2B(Homo sapiens (Human))
University Of Oxford
Curated by ChEMBL
LigandPNGBDBM50150060(CHEMBL3775692)
Affinity DataKd:  2.10E+4nM. Assay description: Binding affinity to N-terminal His-tagged PCAF (715 to 831 residues) (unknown origin) expressed in Escherichia coli Rosetta cells by isothermal titra...