BDBM50151446 (1R,2R,3R,5R,6R)-2-Amino-3-benzyloxy-6-fluoro-bicyclo[3.1.0]hexane-2,6-dicarboxylic acid::CHEMBL186214
SMILES N[C@@]1([C@H]2[C@@H](C[C@H]1OCc1ccccc1)[C@]2(F)C(O)=O)C(O)=O
InChI Key InChIKey=FHUJXFRDZNFBOI-ZNLHFFCSSA-N
Data  2 KI  1 IC50
  Tab Delimited (TSV)   2D SDfile   Computed 3D by Vconf -m prep SDfile
Find this compound or compounds like it in BindingDB:
Activity Spreadsheet -- Enzyme Inhibition Constant Data from BindingDB
Found 3 hits for monomerid = 50151446
TargetMetabotropic glutamate receptor 2(Homo sapiens (Human))
Taisho Pharmaceutical
Curated by ChEMBL
LigandPNGBDBM50151446((1R,2R,3R,5R,6R)-2-Amino-3-benzyloxy-6-fluoro-bicy...)
Affinity DataKi:  7.14nM. Assay description: Binding affinity towards metabotropic glutamate receptor 2 of rat expressed in CHO cells was determined by using [3H]-MGS0008
In DepthDetails ArticlePubMed
TargetMetabotropic glutamate receptor 3(Rattus norvegicus (Rat))
Taisho Pharmaceutical
Curated by ChEMBL
LigandPNGBDBM50151446((1R,2R,3R,5R,6R)-2-Amino-3-benzyloxy-6-fluoro-bicy...)
Affinity DataKi:  15.9nM. Assay description: Binding affinity towards metabotropic glutamate receptor 3 of rat expressed in CHO cells was determined by using [3H]-MGS0008
In DepthDetails ArticlePubMed
TargetMetabotropic glutamate receptor 2(Homo sapiens (Human))
Taisho Pharmaceutical
Curated by ChEMBL
LigandPNGBDBM50151446((1R,2R,3R,5R,6R)-2-Amino-3-benzyloxy-6-fluoro-bicy...)
Affinity DataIC50:  131nM. Assay description: Concentration required to inhibit metabotropic glutamate receptor 2 activity of rat expressed in CHO cells
In DepthDetails ArticlePubMed