BDBM50151898 3-(3-Pyridin-2-yl-[1,2,4]triazol-1-yl)-benzonitrile::CHEMBL189808
SMILES N#Cc1cccc(c1)-n1cnc(n1)-c1ccccn1
InChI Key InChIKey=WTABOJQYURJHSB-UHFFFAOYSA-N
Data  1 KI  1 IC50
  Tab Delimited (TSV)   2D SDfile   Computed 3D by Vconf -m prep SDfile
Find this compound or compounds like it in BindingDB:
Activity Spreadsheet -- Enzyme Inhibition Constant Data from BindingDB
Found 2 hits for monomerid = 50151898
TargetMetabotropic glutamate receptor 5(Rattus norvegicus (Rat))
TBA
Curated by ChEMBL
LigandPNGBDBM50151898(3-(3-Pyridin-2-yl-[1,2,4]triazol-1-yl)-benzonitril...)
Affinity DataKi: >600nM. Assay description: Displacement of [3H]-3-methoxy-5-(pyridin-2-ylethynyl)pyridine from glutamate 5 receptor of rat cortical membranes
In DepthDetails ArticlePubMed
TargetMetabotropic glutamate receptor 5(Homo sapiens (Human))
TBA
Curated by ChEMBL
LigandPNGBDBM50151898(3-(3-Pyridin-2-yl-[1,2,4]triazol-1-yl)-benzonitril...)
Affinity DataIC50:  690nM. Assay description: Inhibitory concentration towards human glutamate receptor 5 in calcium flux assay
In DepthDetails ArticlePubMed