BDBM50152897 2-(4-Chloro-benzylamino)-6-ethyl-pyrimidin-4-ol::CHEMBL185123
SMILES CCc1cc(=O)[nH]c(NCc2ccc(Cl)cc2)n1
InChI Key InChIKey=LIMGGNNDNQRBJG-UHFFFAOYSA-N
Data  2 IC50
  Tab Delimited (TSV)   2D SDfile   Computed 3D by Vconf -m prep SDfile
Find this compound or compounds like it in BindingDB:
Activity Spreadsheet -- Enzyme Inhibition Constant Data from BindingDB
Found 2 hits for monomerid = 50152897
TargetFatty acid-binding protein, adipocyte(Homo sapiens (Human))TBA
LigandPNGBDBM50152897(2-(4-Chloro-benzylamino)-6-ethyl-pyrimidin-4-ol | ...)
Affinity DataIC50:  4.70E+4nM. Assay description: Inhibition of recombinant human FABP4
In DepthDetails PubMed
TargetFatty acid-binding protein, adipocyte(Homo sapiens (Human))TBA
LigandPNGBDBM50152897(2-(4-Chloro-benzylamino)-6-ethyl-pyrimidin-4-ol | ...)
Affinity DataIC50:  4.70E+4nM. Assay description: In vitro inhibitory concentration against A-FABP (Adipocyte fatty acid binding protein)
In DepthDetails ArticlePubMed