BDBM50156196 (1S,2R)-2-Amino-1-(4-bromo-2,5-dimethoxy-phenyl)-propan-1-ol::CHEMBL364723
SMILES COc1cc([C@H](O)[C@@H](C)N)c(OC)cc1Br
InChI Key InChIKey=YLLHAHHNKOUOSR-KSBSHMNSSA-N
Data  2 KI
  Tab Delimited (TSV)   2D SDfile   Computed 3D by Vconf -m prep SDfile
Find this compound or compounds like it in BindingDB:
Activity Spreadsheet -- Enzyme Inhibition Constant Data from BindingDB
Found 2 hits for monomerid = 50156196
Target5-hydroxytryptamine receptor 2A(Rattus norvegicus (rat))
Virginia Commonwealth University
Curated by ChEMBL
LigandPNGBDBM50156196((1S,2R)-2-Amino-1-(4-bromo-2,5-dimethoxy-phenyl)-p...)
Affinity DataKi:  9.20nM. Assay description: Human progesterone receptor (hPR) agonist activity in T47D human breast cancer cell line
In DepthDetails ArticlePubMed
Target5-hydroxytryptamine receptor 2A(Rattus norvegicus (rat))
Virginia Commonwealth University
Curated by ChEMBL
LigandPNGBDBM50156196((1S,2R)-2-Amino-1-(4-bromo-2,5-dimethoxy-phenyl)-p...)
Affinity DataKi:  9.20nM. Assay description: Binding affinity for 5-HT2A serotonin receptor
In DepthDetails ArticlePubMed