BDBM50159948 CHEMBL3785312::US10093640, Example 131::US10844032, Example 131
SMILES Cc1cc(OCCCc2c([nH]c3ccccc23)C(=O)NS(=O)(=O)c2ccccc2)cc(C)c1Cl
InChI Key InChIKey=SMGRUAFEHILHHU-UHFFFAOYSA-N
Data  2 KI  1 IC50
PDB links: 1 PDB ID matches this monomer.
  Tab Delimited (TSV)   2D SDfile   Computed 3D by Vconf -m prep SDfile
Find this compound or compounds like it in BindingDB:
Activity Spreadsheet -- Enzyme Inhibition Constant Data from BindingDB
Found 3 hits for monomerid = 50159948
TargetInduced myeloid leukemia cell differentiation protein Mcl-1(Homo sapiens (Human))
Vanderbilt University School Of Medicine
Curated by ChEMBL
LigandPNGBDBM50159948(CHEMBL3785312 | US10093640, Example 131 | US108440...)
Affinity DataKi:  361nM. Assay description: Displacement of FITC-Bak-BH3 peptide probe from N-terminal His-tagged human Mcl-1 (172 to 327 residues) expressed in Escherichia coli BL21(DE3) after...
TargetInduced myeloid leukemia cell differentiation protein Mcl-1 [172-327](Homo sapiens (Human))
Vanderbilt University
US Patent
LigandPNGBDBM50159948(CHEMBL3785312 | US10093640, Example 131 | US108440...)
Affinity DataKi:  400nM. Assay description: The assay was run using a fluorescein isothiocyanate-labeled BH3 peptide derived from Bak (FITC-AHx-GQVGRQLAIIGDDINR-NH2) that was purchased from Gen...
TargetInduced myeloid leukemia cell differentiation protein Mcl-1(Homo sapiens (Human))
Vanderbilt University School Of Medicine
Curated by ChEMBL
LigandPNGBDBM50159948(CHEMBL3785312 | US10093640, Example 131 | US108440...)
Affinity DataIC50:  400nMpH: 7.5 T: 2°C. Assay description: Compound affinity was measured using a fluorescence polarization anisotropy competition assay. Anisotropy measurements were carried out in 384-well, ...