BDBM50165419 8-{2-[4-(3,4-Difluoro-phenyl)-piperazin-1-yl]-ethyl}-8-aza-spiro[4.5]decane-7,9-dione::CHEMBL192099
SMILES Fc1ccc(cc1F)N1CCN(CCN2C(=O)CC3(CCCC3)CC2=O)CC1
InChI Key InChIKey=RZWIBVNDYKVOQZ-UHFFFAOYSA-N
Data  6 KI
  Tab Delimited (TSV)   2D SDfile   Computed 3D by Vconf -m prep SDfile
Find this compound or compounds like it in BindingDB:
Activity Spreadsheet -- Enzyme Inhibition Constant Data from BindingDB
Found 6 hits for monomerid = 50165419
TargetAlpha-1D adrenergic receptor(Homo sapiens (Human))
Lundbeck Research Usa
Curated by ChEMBL
LigandPNGBDBM50165419(8-{2-[4-(3,4-Difluoro-phenyl)-piperazin-1-yl]-ethy...)
Affinity DataKi:  7.90nM. Assay description: Binding affinity for human Alpha-1D adrenergic receptor
In DepthDetails ArticlePubMed
Target5-hydroxytryptamine receptor 1A(Homo sapiens (Human))
Lundbeck Research Usa
Curated by ChEMBL
LigandPNGBDBM50165419(8-{2-[4-(3,4-Difluoro-phenyl)-piperazin-1-yl]-ethy...)
Affinity DataKi:  55nM. Assay description: Binding affinity for human 5-hydroxytryptamine 1A receptor
In DepthDetails ArticlePubMed
TargetD(3) dopamine receptor(Rattus norvegicus (Rat))
Lundbeck Research Usa
Curated by ChEMBL
LigandPNGBDBM50165419(8-{2-[4-(3,4-Difluoro-phenyl)-piperazin-1-yl]-ethy...)
Affinity DataKi:  160nM. Assay description: Binding affinity for rat Dopamine receptor D3
In DepthDetails ArticlePubMed
TargetAlpha-1B adrenergic receptor(Homo sapiens (Human))
Lundbeck Research Usa
Curated by ChEMBL
LigandPNGBDBM50165419(8-{2-[4-(3,4-Difluoro-phenyl)-piperazin-1-yl]-ethy...)
Affinity DataKi:  1.40E+3nM. Assay description: Binding affinity for human Alpha-1B adrenergic receptor
In DepthDetails ArticlePubMed
TargetD(2) dopamine receptor(Homo sapiens (Human))
Lundbeck Research Usa
Curated by ChEMBL
LigandPNGBDBM50165419(8-{2-[4-(3,4-Difluoro-phenyl)-piperazin-1-yl]-ethy...)
Affinity DataKi:  2.20E+3nM. Assay description: Binding affinity for human Dopamine receptor D2
In DepthDetails ArticlePubMed
TargetAlpha-1A adrenergic receptor(Homo sapiens (Human))
Lundbeck Research Usa
Curated by ChEMBL
LigandPNGBDBM50165419(8-{2-[4-(3,4-Difluoro-phenyl)-piperazin-1-yl]-ethy...)
Affinity DataKi:  4.10E+3nM. Assay description: Binding affinity for human Alpha-1A adrenergic receptor
In DepthDetails ArticlePubMed