BDBM50165487 1-[3-(4-Oxo-3,4-dihydro-phthalazin-1-ylmethyl)-phenyl]-pyrrole-2,5-dione::CHEMBL363617
SMILES O=C1C=CC(=O)N1c1cccc(Cc2n[nH]c(=O)c3ccccc23)c1
InChI Key InChIKey=OKOQVTWKOPFLQX-UHFFFAOYSA-N
Data  1 IC50
  Tab Delimited (TSV)   2D SDfile   Computed 3D by Vconf -m prep SDfile
Find this compound or compounds like it in BindingDB:
Activity Spreadsheet -- Enzyme Inhibition Constant Data from BindingDB
Found 1 hit for monomerid = 50165487
TargetPoly [ADP-ribose] polymerase 1(Homo sapiens (Human))
Kudos Horsham
Curated by ChEMBL
LigandPNGBDBM50165487(1-[3-(4-Oxo-3,4-dihydro-phthalazin-1-ylmethyl)-phe...)
Affinity DataIC50:  13nM. Assay description: Inhibitory concentration against human poly (ADP-ribose) polymerase 1 (PARP-1)
In DepthDetails ArticlePubMed