BDBM50168348 3-(3-FLUORO-4-HYDROXYPHENYL)-7-HYDROXY-1-NAPHTHONITRILE::3-(3-Fluoro-4-hydroxy-phenyl)-7-hydroxy-naphthalene-1-carbonitrile::CHEMBL192154
SMILES Oc1ccc2cc(cc(C#N)c2c1)-c1ccc(O)c(F)c1
InChI Key InChIKey=NSSOSHDCWCMNDM-UHFFFAOYSA-N
Data  2 IC50
PDB links: 1 PDB ID matches this monomer.
  Tab Delimited (TSV)   2D SDfile   Computed 3D by Vconf -m prep SDfile
Find this compound or compounds like it in BindingDB:
Activity Spreadsheet -- Enzyme Inhibition Constant Data from BindingDB
Found 2 hits for monomerid = 50168348
TargetEstrogen receptor beta(Homo sapiens (Human))
Wyeth Research
Curated by ChEMBL
LigandPNGBDBM50168348(3-(3-FLUORO-4-HYDROXYPHENYL)-7-HYDROXY-1-NAPHTHONI...)
Affinity DataIC50:  2.70nM. Assay description: Inhibition of [3H]-17-beta-estradiol binding to human estrogen receptor beta expressed in Escherichia coli
TargetEstrogen receptor(Homo sapiens (Human))
Wyeth Research
Curated by ChEMBL
LigandPNGBDBM50168348(3-(3-FLUORO-4-HYDROXYPHENYL)-7-HYDROXY-1-NAPHTHONI...)
Affinity DataIC50:  210nM. Assay description: Inhibition of [3H]-17-beta-estradiol binding to human estrogen receptor alpha expressed in Escherichia coli
In DepthDetails ArticlePubMed