BDBM50173367 1-(4-tert-Butyl-phenyl)-5-hydroxy-3-(3-trifluoromethyl-phenoxy)-1H-indole-2-carboxylic acid::CHEMBL373048
SMILES CC(C)(C)c1ccc(cc1)-n1c(C(O)=O)c(Oc2cccc(c2)C(F)(F)F)c2cc(O)ccc12
InChI Key InChIKey=SXZMFGXNDCTAOG-UHFFFAOYSA-N
Data  2 IC50
  Tab Delimited (TSV)   2D SDfile   Computed 3D by Vconf -m prep SDfile
Find this compound or compounds like it in BindingDB:
Activity Spreadsheet -- Enzyme Inhibition Constant Data from BindingDB
Found 2 hits for monomerid = 50173367
TargetPeroxisome proliferator-activated receptor alpha(Homo sapiens (Human))
Merck Research Laboratories
Curated by ChEMBL
LigandPNGBDBM50173367(1-(4-tert-Butyl-phenyl)-5-hydroxy-3-(3-trifluorome...)
Affinity DataIC50: >5.00E+4nM. Assay description: Inhibitory concentration against human peroxisome proliferator activated receptor alpha in SPA assay
In DepthDetails ArticlePubMed
TargetPeroxisome proliferator-activated receptor gamma(Homo sapiens (Human))
Merck Research Laboratories
Curated by ChEMBL
LigandPNGBDBM50173367(1-(4-tert-Butyl-phenyl)-5-hydroxy-3-(3-trifluorome...)
Affinity DataIC50:  318nM. Assay description: Inhibitory concentration against human peroxisome proliferator activated receptor gamma in SPA assay
In DepthDetails ArticlePubMed