BDBM50173375 CHEMBL3810248
SMILES C[Si](C)(C)c1ccc(cc1)-c1ccc2nnc(n2c1)C(F)(F)F
InChI Key InChIKey=ACRMMCGSOUYBCS-UHFFFAOYSA-N
Data  1 IC50
  Tab Delimited (TSV)   2D SDfile   Computed 3D by Vconf -m prep SDfile
Find this compound or compounds like it in BindingDB:
Activity Spreadsheet -- Enzyme Inhibition Constant Data from BindingDB
Found 1 hit for monomerid = 50173375
TargetSodium channel protein type 5 subunit alpha(Homo sapiens (Human))
Gilead Sciences
Curated by ChEMBL
LigandPNGBDBM50173375(CHEMBL3810248)
Affinity DataIC50:  59nM. Assay description: Inhibition of Nav 1.5 (unknown origin) assessed as reduction in late channel current
In DepthDetails ArticlePubMed