BDBM50179961 1-(9-amino-11,12-dihydro-6H-dibenzo[b,f]azocin-5-yl)-ethanone::CHEMBL205914
SMILES CC(=O)N1Cc2ccc(N)cc2CCc2ccccc12
InChI Key InChIKey=AMDWNAYTRGSIOI-UHFFFAOYSA-N
Data  2 IC50
  Tab Delimited (TSV)   2D SDfile   Computed 3D by Vconf -m prep SDfile
Find this compound or compounds like it in BindingDB:
Activity Spreadsheet -- Enzyme Inhibition Constant Data from BindingDB
Found 2 hits for monomerid = 50179961
Target17-beta-hydroxysteroid dehydrogenase type 3(Homo sapiens (Human))
Bristol-Myers Squibb Pharmaceutical Research Institute
Curated by ChEMBL
LigandPNGBDBM50179961(1-(9-amino-11,12-dihydro-6H-dibenzo[b,f]azocin-5-y...)
Affinity DataIC50:  490nM. Assay description: Inhibition of 17beta-HSD3
In DepthDetails ArticlePubMed
Target17-beta-hydroxysteroid dehydrogenase type 3(Homo sapiens (Human))
Bristol-Myers Squibb Pharmaceutical Research Institute
Curated by ChEMBL
LigandPNGBDBM50179961(1-(9-amino-11,12-dihydro-6H-dibenzo[b,f]azocin-5-y...)
Affinity DataIC50:  490nM. Assay description: Inhibition of 17beta-HSD3 by SEAP assay
In DepthDetails ArticlePubMed