BDBM50180207 (2S,3S,4R,5R)-5-(2-chloro-6-(methylamino)-9H-purin-9-yl)-3,4-dihydroxy-N-isopentyl-tetrahydrothiophene-2-carboxamide::CHEMBL201324
SMILES CNc1nc(Cl)nc2n(cnc12)[C@@H]1S[C@@H]([C@@H](O)[C@H]1O)C(=O)NCCC(C)C
InChI Key InChIKey=NEZROWUWNJMYCW-BQVMBELUSA-N
Data  2 KI
  Tab Delimited (TSV)   2D SDfile   Computed 3D by Vconf -m prep SDfile
Find this compound or compounds like it in BindingDB:
Activity Spreadsheet -- Enzyme Inhibition Constant Data from BindingDB
Found 2 hits for monomerid = 50180207
TargetAdenosine receptor A3(Homo sapiens (Human))
Ewha Womans University
Curated by ChEMBL
LigandPNGBDBM50180207((2S,3S,4R,5R)-5-(2-chloro-6-(methylamino)-9H-purin...)
Affinity DataKi:  1.63nM. Assay description: Displacement of [125I]AB-MECA from human adenosine A3 receptor transfected in CHO cells
In DepthDetails ArticlePubMed
TargetAdenosine receptor A1(Homo sapiens (Human))
Ewha Womans University
Curated by ChEMBL
LigandPNGBDBM50180207((2S,3S,4R,5R)-5-(2-chloro-6-(methylamino)-9H-purin...)
Affinity DataKi:  4.07E+3nM. Assay description: Displacement of [3H]R-PIA from human adenosine A1 receptor transfected in CHO cells
In DepthDetails ArticlePubMed