BDBM50180873 CHEMBL3819582::US10759791, Compound 14e
SMILES COCCCNc1cncc(CCc2cc(C)cc(N)n2)c1
InChI Key InChIKey=DFYOVMPZILDHIP-UHFFFAOYSA-N
Data  4 KI
PDB links: 1 PDB ID matches this monomer.
  Tab Delimited (TSV)   2D SDfile   Computed 3D by Vconf -m prep SDfile
Find this compound or compounds like it in BindingDB:
Activity Spreadsheet -- Enzyme Inhibition Constant Data from BindingDB
Found 4 hits for monomerid = 50180873
TargetNitric oxide synthase, brain(Rattus norvegicus (rat))
Northwestern University
Curated by ChEMBL
LigandPNGBDBM50180873(CHEMBL3819582 | US10759791, Compound 14e)
Affinity DataKi:  558nM. Assay description: Inhibition of rat recombinant nNOS expressed in Escherichia coli using L-arginine as substrate assessed as reduction in NO production measured for 6 ...
TargetNitric oxide synthase, brain(Rattus norvegicus (rat))
Northwestern University
Curated by ChEMBL
LigandPNGBDBM50180873(CHEMBL3819582 | US10759791, Compound 14e)
Affinity DataKi:  558nM. Assay description: Enzyme inhibition was evaluated by measuring NO production with the hemoglobin capture assay, which was performed with purified NOSs in 96-well plate...
TargetNitric oxide synthase, inducible(Mus musculus (mouse))
Northwestern University
US Patent
LigandPNGBDBM50180873(CHEMBL3819582 | US10759791, Compound 14e)
Affinity DataKi:  7.05E+3nM. Assay description: Enzyme inhibition was evaluated by measuring NO production with the hemoglobin capture assay, which was performed with purified NOSs in 96-well plate...
In DepthDetails US Patent
TargetNitric oxide synthase, inducible(Mus musculus (mouse))
Northwestern University
US Patent
LigandPNGBDBM50180873(CHEMBL3819582 | US10759791, Compound 14e)
Affinity DataKi:  7.05E+3nM. Assay description: Inhibition of recombinant mouse macrophage iNOS expressed in Escherichia coli using L-arginine as substrate assessed as reduction in NO production me...
In DepthDetails ArticlePubMed